{"text_format":"1","workbook":"xlsx","n_sheets":3,"sheets":["Recent","Own","Sheet1"],"not_rendered":{"charts":0,"images":0,"macros":1,"external_links":0,"defined_names":152,"comments":0,"pivot_tables":0},"unopened":[],"bounds":{"document_bytes":16777216,"sheet_cells":100000,"rows_first":2000,"rows_last":500,"rows_between":2000,"halvings":0,"cell_chars":16384,"cell_head_chars":4096},"cells_cut":0,"cells_raw":0,"read":"whole","date_system":"1900"}

{"sheet":"Recent","index":0,"n_rows":101,"n_cols":7,"rows_kept":101,"cut":false,"hidden":false,"merged":[]}
["NFT Name","Link","Created at","Sold Count","Own","Days",7]
["Writing NFT - 逆轉被駭資產：以太坊的可逆交易 ERC-20R、去中心化法庭 DAO - 區塊勢","https://liker.land/nft/class/likenft1w8j2jd4nd5tagcq8hz49cpxhtnk49d5gkhyfs4jx56ps9ra5p9xqwgsyt6","2022-10-18T00:32:25Z",500,{"$f":"NOT(ISNA(VLOOKUP(A2,Own!A:A,1,FALSE)))","v":false}]
["Writing NFT - 2022 蚵寮漁村小搖滾 - Kuàn-ka (@ttt50966)","https://liker.land/nft/class/likenft16mx4vppy9lgfg8n4hrlhfedj3ceaepsr69znjdahpumnsezckz9s3tshxx","2022-10-17T16:09:41Z",499,{"$f":"NOT(ISNA(VLOOKUP(A3,Own!A:A,1,FALSE)))","v":true}]
["Writing NFT - 台東最糟也最棒的書店 —— 晃晃書店","https://liker.land/nft/class/likenft1ghwaeqyz8kwxyvkcafkfy900q8m7dj2tk8kz7u0p6f0cpum740gqka5ewr","2022-10-17T15:59:39Z",500,{"$f":"NOT(ISNA(VLOOKUP(A4,Own!A:A,1,FALSE)))","v":false}]
["Writing NFT - 台東咖啡故事：只想帶給別人幸福的咖啡店 ── 兔子吐泡泡（回憶版）","https://liker.land/nft/class/likenft1qff9d27pfnj0n2e0ac809vhth4jydjgtl0y3gqp569g93m54rspq2wknu7","2022-10-17T15:58:33Z",500,{"$f":"NOT(ISNA(VLOOKUP(A5,Own!A:A,1,FALSE)))","v":false}]
["Writing NFT - 在台東，看海發呆去","https://liker.land/nft/class/likenft1k7ppad39v8045qtfq0qgk3vtnp6p3fwekhgycmw6jh7a625rrcuqacacpw","2022-10-17T15:57:45Z",500,{"$f":"NOT(ISNA(VLOOKUP(A6,Own!A:A,1,FALSE)))","v":false}]
["Writing NFT - 【文生書法】有橋","https://liker.land/nft/class/likenft1lvntsa5ejqvajn9ckzc3x8ym32uw3mahx3kcuxd22kg02n2lrqdqgdmfea","2022-10-17T14:52:56Z",998,{"$f":"NOT(ISNA(VLOOKUP(A7,Own!A:A,1,FALSE)))","v":false}]
["Writing NFT - 【文生影評】戀戀風塵---既濃又淡的生命力","https://liker.land/nft/class/likenft18qqssutp7rnmp6qz9zy4urevlmp5p0lauj9j7q4frxmv887th97sea6r45","2022-10-17T14:34:56Z",1000,{"$f":"NOT(ISNA(VLOOKUP(A8,Own!A:A,1,FALSE)))","v":false}]
["Writing NFT - 【文生書評】許三觀賣血記---荒謬的群像","https://liker.land/nft/class/likenft1vpfd0qdk2az2uh56rj36k5k7uh93safn3azrq6c78975jh2smv2stvaq9z","2022-10-17T14:14:22Z",998,{"$f":"NOT(ISNA(VLOOKUP(A9,Own!A:A,1,FALSE)))","v":true}]
["Writing NFT - 〔旅行到克羅埃西亞〕秋末的十六湖國家公園散步日記","https://liker.land/nft/class/likenft1s8hk85hc2q79kjnh4pmxvdfz93fdtrnxw9trskcpk25yvx548e5q5qf8x4","2022-10-17T13:20:09Z",500,{"$f":"NOT(ISNA(VLOOKUP(A10,Own!A:A,1,FALSE)))","v":false}]
["Writing NFT - （中學生導讀）法文世界的「白朗峰」：維克多·雨果 - 私の部屋，世界、歷史、人的万華鏡。 (@chtewu)","https://liker.land/nft/class/likenft1a6w2ktuy07tvyzrsl348p4d9el92r44rlr6mt5qmurgumtw289dqj8u25k","2022-10-17T12:56:05Z",498,{"$f":"NOT(ISNA(VLOOKUP(A11,Own!A:A,1,FALSE)))","v":false}]
["Writing NFT - （導讀）偵探推理界的「瑪麗皇后峰」：柯南．道爾 - 私の部屋，世界、歷史、人的万華鏡。 (@chtewu)","https://liker.land/nft/class/likenft1xnvaua2lzp6gwr6ehajxcfgdwfyffxk8yxr5fxm24u4cysj3qtaslz4cp3","2022-10-17T12:52:07Z",498,{"$f":"NOT(ISNA(VLOOKUP(A12,Own!A:A,1,FALSE)))","v":true}]
["Writing NFT - （中學生導讀）西方文學的「聖母峰」：莎士比亞 - 私の部屋，世界、歷史、人的万華鏡。 (@chtewu)","https://liker.land/nft/class/likenft1jcqxuv683ykqgtr0qpw206255pgyt3dcyfw4x309stc5e6p55g8samn60d","2022-10-17T12:48:51Z",499,{"$f":"NOT(ISNA(VLOOKUP(A13,Own!A:A,1,FALSE)))","v":false}]
["Writing NFT - 「逝去的時代」台北三溫暖 Taipei Sauna","https://liker.land/nft/class/likenft15mmuldd6gfywsaqjnwqlp7xm3fckjyw0ejm8lc0ujqs6av8x9v3s8ndcvz","2022-10-17T10:23:29Z",994,{"$f":"NOT(ISNA(VLOOKUP(A14,Own!A:A,1,FALSE)))","v":true}]
["Writing NFT - 「逝去的時代」台北三溫暖 Taipei Sauna","https://liker.land/nft/class/likenft1ud4gdd2vlkq9jempplvj37pc9f839fkj2hk5pph5xlhqsjtrlxfqdlfd9m","2022-10-17T09:31:56Z",0,{"$f":"NOT(ISNA(VLOOKUP(A15,Own!A:A,1,FALSE)))","v":true}]
["Writing NFT - 【365天的知名壽星】酒客、貓奴、京都人。 - 私の部屋，世界、歷史、人的万華鏡。 (@chtewu)","https://liker.land/nft/class/likenft1h9enk8uq362w9p5tk7gkggq4j7chs40ndg6nrern7l5t49a7kges77uf55","2022-10-16T12:24:26Z",500,{"$f":"NOT(ISNA(VLOOKUP(A16,Own!A:A,1,FALSE)))","v":false}]
["Writing NFT - 【餐桌隨筆】古道照顏色，三杯雞。 - 私の部屋，世界、歷史、人的万華鏡。 (@chtewu)","https://liker.land/nft/class/likenft1jye3zfmhp9mpww3gjcz6sarv2juddgxlzzvy330emkm86rd7dj2qke9x2p","2022-10-16T12:19:09Z",499,{"$f":"NOT(ISNA(VLOOKUP(A17,Own!A:A,1,FALSE)))","v":false}]
["Writing NFT - 在旅途中尋找最珍貴的禮物 - 第十三章","https://liker.land/nft/class/likenft1nae0wnqq3z8w69j5cqkk0v0cv077pkp4nhy64k6s9hh6lqdk0kvq4sf8hu","2022-10-16T06:12:54Z",1000,{"$f":"NOT(ISNA(VLOOKUP(A18,Own!A:A,1,FALSE)))","v":false}]
["Writing NFT - 實體與虛擬出版之間的抉擇","https://liker.land/nft/class/likenft1v0n75ttfhhj2znxf2grmvefqavvj7qy6sut62asdk7k4nkp5yuzqnvdlm3","2022-10-16T01:47:42Z",500,{"$f":"NOT(ISNA(VLOOKUP(A19,Own!A:A,1,FALSE)))","v":true}]
["Writing NFT - 亞皆老號","https://liker.land/nft/class/likenft1a4hvq4ny3vrtyk5uakdll7kqkn6rp4p2sxar2hlq8m6t24axrwdseskvsl","2022-10-15T17:17:51Z",1000,{"$f":"NOT(ISNA(VLOOKUP(A20,Own!A:A,1,FALSE)))","v":false}]
["Writing NFT - 世界所有的對話都是文學","https://liker.land/nft/class/likenft17put74vwxxjxmeu0gcxfg4lttp33ygns59h8q6p88vm5n9q7kr7q6ptnd5","2022-10-15T17:15:30Z",1000,{"$f":"NOT(ISNA(VLOOKUP(A21,Own!A:A,1,FALSE)))","v":false}]
["Writing NFT - 天下嘉農！吳昌征！","https://liker.land/nft/class/likenft1guzzpd557v50n2wvv4d3wtw70ppf9ktj7vgqz7jzh2x8pxaqp7vqqm6wxd","2022-10-15T15:54:19Z",996,{"$f":"NOT(ISNA(VLOOKUP(A22,Own!A:A,1,FALSE)))","v":false}]
["Writing NFT - 【英皇系列第三講】不愛江山愛美人，愛德華八世。","https://liker.land/nft/class/likenft1ttu4sv9hy099g7t9qmnhuahdpxgfhr7cj8fttcqcrrhfu7znddvq534fdd","2022-10-15T15:52:04Z",998,{"$f":"NOT(ISNA(VLOOKUP(A23,Own!A:A,1,FALSE)))","v":false}]
["Writing NFT - 【英皇系列第四講】王者天下，喬治五世","https://liker.land/nft/class/likenft1n4m92stesz878ttykdvc5cgagmht2p8ps0l4rqgjuv7zwnqdsyqshnsfm6","2022-10-15T15:49:35Z",998,{"$f":"NOT(ISNA(VLOOKUP(A24,Own!A:A,1,FALSE)))","v":false}]
["Writing NFT - EIDOS Cafe 晴境易得咖啡館","https://liker.land/nft/class/likenft18x7lxjg0j5szv4hzyapre0r7zeqv9vkrdkdnm5njq2lx8sjkfazsyaku6w","2022-10-15T15:08:36Z",1000,{"$f":"NOT(ISNA(VLOOKUP(A25,Own!A:A,1,FALSE)))","v":false}]
["Writing NFT - 那條路，通往自由。","https://liker.land/nft/class/likenft1aaztl9u7exn0s65pnf7m2v0jm43ujdzgwvlctuu6yyhh7uv4pztqx0srrh","2022-10-15T13:01:36Z",998,{"$f":"NOT(ISNA(VLOOKUP(A26,Own!A:A,1,FALSE)))","v":false}]
["Writing NFT - 死過一次的台灣，我們。","https://liker.land/nft/class/likenft1w5xen8mhx6q33fxskt59x6fkuyc9hgrc0twqhxf7x47gylhce0gsmmddsj","2022-10-15T12:59:18Z",1000,{"$f":"NOT(ISNA(VLOOKUP(A27,Own!A:A,1,FALSE)))","v":false}]
["Writing NFT - 【英皇系列第五講】英倫愛未眠，愛德華七世（下）","https://liker.land/nft/class/likenft12qnex54rag8vxk36rwtmw7lpv7lxyus00j7hjwzpwzppkzyml07s3qlnns","2022-10-15T12:57:02Z",1000,{"$f":"NOT(ISNA(VLOOKUP(A28,Own!A:A,1,FALSE)))","v":false}]
["Writing NFT - 【英皇系列第五講】英倫愛未眠，愛德華七世（上）","https://liker.land/nft/class/likenft1y32zremrkuqu842ttpcsed8c0c9nu2xplktehwuahy0d6hfk42cswtac0a","2022-10-15T12:54:56Z",1000,{"$f":"NOT(ISNA(VLOOKUP(A29,Own!A:A,1,FALSE)))","v":false}]
["Writing NFT - 《慕尼黑協定》，誰理你們？｜方格子 vocus","https://liker.land/nft/class/likenft17hv4av7swjd0w0mmq2f9s393w2jgtkcwgvt7ch79kkkq27z4qwzqq40e73","2022-10-15T12:52:15Z",500,{"$f":"NOT(ISNA(VLOOKUP(A30,Own!A:A,1,FALSE)))","v":false}]
["Writing NFT - On This Day，Perfect Game。 - 私の部屋，世界、歷史、人的万華鏡。 (@chtewu)","https://liker.land/nft/class/likenft1ng0r2ce0g0l58kwuj35x97yw6fr08ldng4uyx4zzzw5ywxne8nysmz4jdx","2022-10-15T12:46:52Z",500,{"$f":"NOT(ISNA(VLOOKUP(A31,Own!A:A,1,FALSE)))","v":false}]
["Writing NFT - 婚禮說（姐姐的婚禮致詞）","https://liker.land/nft/class/likenft1q5n8uur2s6kzd47s8h7aqrap6pz6jpnshruspth9r3jkcsqmymnszxuk90","2022-10-15T10:41:14Z",1000,{"$f":"NOT(ISNA(VLOOKUP(A32,Own!A:A,1,FALSE)))","v":false}]
["Writing NFT - 婚禮說（姐姐的婚禮致詞）","https://liker.land/nft/class/likenft1fvq3940vtpfyewkkmkz80w93flxtlnjpmw73r22r42phkw68tk2sfzdk94","2022-10-15T10:35:30Z",0,{"$f":"NOT(ISNA(VLOOKUP(A33,Own!A:A,1,FALSE)))","v":false}]
["Writing NFT - 婚禮說（姐姐的婚禮致詞）","https://liker.land/nft/class/likenft1tdjgy4daed9zjt82laqnuwn4309gfzsv4lg9u4errxpswc4th6csx2s8rz","2022-10-15T10:33:49Z",0,{"$f":"NOT(ISNA(VLOOKUP(A34,Own!A:A,1,FALSE)))","v":false}]
["Writing NFT - 婚禮說（姐姐的婚禮致詞）","https://liker.land/nft/class/likenft1gl44jwnxnmcsfx6m37th42wnqt30mn936fqm5gnaqcwg6hsq6c6ssewlrw","2022-10-15T10:12:15Z",0,{"$f":"NOT(ISNA(VLOOKUP(A35,Own!A:A,1,FALSE)))","v":false}]
["Writing NFT - 在旅途中尋找最珍貴的禮物 - 第十二章","https://liker.land/nft/class/likenft10la5chf3vvzhwv8mqk48d3vu9ysypm88u5qlepfdhtul00mumzxqyzx457","2022-10-15T04:13:42Z",998,{"$f":"NOT(ISNA(VLOOKUP(A36,Own!A:A,1,FALSE)))","v":false}]
["Writing NFT - 在旅途中尋找最珍貴的禮物 - 第十一章","https://liker.land/nft/class/likenft1dschty9htdtza7m0hmz4nhqsnvc2y4l9xtfh8hu9m6neuvtpdf2qpuf4dx","2022-10-15T03:54:20Z",998,{"$f":"NOT(ISNA(VLOOKUP(A37,Own!A:A,1,FALSE)))","v":false}]
["Writing NFT - 在旅途中尋找最珍貴的禮物 - 第十章","https://liker.land/nft/class/likenft1mtmtv0fquvqmqql87aafm4rwsk6xca9nweefz2fyur8z2h3dmzwshp0eg6","2022-10-15T03:53:50Z",998,{"$f":"NOT(ISNA(VLOOKUP(A38,Own!A:A,1,FALSE)))","v":false}]
["Writing NFT - 在旅途中尋找最珍貴的禮物 - 第九章","https://liker.land/nft/class/likenft154dqk7axdceq0m2sn42fx5w2l9tuepey09p4cccuw8v6mh0prdmq8cmet4","2022-10-15T03:52:21Z",998,{"$f":"NOT(ISNA(VLOOKUP(A39,Own!A:A,1,FALSE)))","v":false}]
["Writing NFT - 在旅途中尋找最珍貴的禮物 - 第八章","https://liker.land/nft/class/likenft1gjtdstuk8t0t9ud70fuc85j5jwz4jcmwwc0svc59hzxyvc4htqms2ppflz","2022-10-15T03:50:58Z",998,{"$f":"NOT(ISNA(VLOOKUP(A40,Own!A:A,1,FALSE)))","v":false}]
{"$rows_left_out":62}
{"sheet":"Own","index":1,"n_rows":62,"n_cols":7,"rows_kept":62,"cut":false,"hidden":false,"merged":[]}
["NFT Name","NFT Link","ISCN",null,null,"Address","like13f4glvg80zvfrrs7utft5p68pct4mcq7t5atf6"]
["Writing NFT - 關於 Writing NFT 的發行與使用","https://liker.land/nft/class/likenft103jlmvqgst6jgt2u5jhpgzmp0przzuwsmx8pdgflardulssj5z0sfkj3xe","iscn://likecoin-chain/nmgCduHPyOtq4CyxGyMKbxkAZrkM9ddxDDL7ZEgFtXI"]
["Writing NFT - 光影紀實｜2019年六四30周年燭光晚會【圖輯】","https://liker.land/nft/class/likenft105tuauwkptxjwr7s3j2k40hf7yxtpcvcxjnmkrx4f8dwfgy6xk7s0tyhk6","iscn://likecoin-chain/4ONPXSP30VJSuhhPTly7JzMhZzrGvtrIClnectgNv_o"]
["Writing NFT - Cosmos 2.0：海港城市、跨鏈安全與 ATOM 的新價值 - by 許明恩 - 區塊勢","https://liker.land/nft/class/likenft10eu3x85hdsmft5tsjvx7vf23xufkkq87uq5mav9l6pr8yx6lpueq5h52md","iscn://likecoin-chain/eEwi3cPVRzsjG5zus2hejHQrdT932ot_auJ4V62Z2vc"]
["Writing NFT - 從母姓","https://liker.land/nft/class/likenft10n50zwhu2xa5me7qqgt7vtl686jwr80paznu9ct26pyxx4eesk3s07wl4j","iscn://likecoin-chain/ciWfNOGCXFqGQ3xv5ZAUYrSYHrgqOqUafccnWkckV78"]
["Writing NFT - Start with WHY - 初創筆記（一）","https://liker.land/nft/class/likenft12x4gh3ne3kc3m4purgv42kwr0lum03cj4n357phrmel6svawf9usqhl5gz","iscn://likecoin-chain/4AQRp5wBckNdmJFzwuulSHpCAEe-BBUQ8JEscGOXreQ"]
["Writing NFT - 降低 Web3 操作門檻：LINE 推出 NFT 平台、Robinhood 打造免手續費錢包 - by 許明恩","https://liker.land/nft/class/likenft137q4n3vy7cw2h7n4778lkmm2czyrjzzhfdgys783w4vdmlvttvkszchchx","iscn://likecoin-chain/QVe4mSWZjtwF8qF6_tR8-X2vVuyuQZFtQOJTTjNtbMQ"]
["Writing NFT - ETHPoW：跟著投機者佈局以太坊合併 - by 許明恩 - 區塊勢","https://liker.land/nft/class/likenft13pwvgcs4td0k4n4c2uqw47060ju7nrfpnkvkst34ruaua5nrarxsshsl9s","iscn://likecoin-chain/jKpXcvZXdSf3GCLretc4mqYnxTjm2f3c8TpAH2CZgJU"]
["Writing NFT - 「逝去的時代」台北三溫暖 Taipei Sauna","https://liker.land/nft/class/likenft15mmuldd6gfywsaqjnwqlp7xm3fckjyw0ejm8lc0ujqs6av8x9v3s8ndcvz","iscn://likecoin-chain/9LaI9Co3OAd1oa-XStTXPbRjyYfmfT2kU-JxlFRxEe4"]
["Writing NFT - 50多歲才開始做自媒體，會不會太遲？","https://liker.land/nft/class/likenft16hnygp7r2wzaatlqk4gpteweq4k7gjzvzsn7g6xgsv5jqr3mjrfqmkhr27","iscn://likecoin-chain/YYk1X0Eyh7ILHAg48m4mADoHKJsU6kmw5YmCiBJvKhA"]
["Writing NFT - 2022 蚵寮漁村小搖滾 - Kuàn-ka (@ttt50966)","https://liker.land/nft/class/likenft16mx4vppy9lgfg8n4hrlhfedj3ceaepsr69znjdahpumnsezckz9s3tshxx","iscn://likecoin-chain/4VKgypsVibPEKt_LZ7JeN5cVhXYS7wb3BVXgr6kLEwQ"]
["Writing NFT - 我在廢墟的窗戶看到不一樣的風景","https://liker.land/nft/class/likenft17culfdavvpphwhdpv5k73kdgqxudz7q0fjl8mx09w6udn0mrgu9sfzp8kj","iscn://likecoin-chain/0OGocKXsbYUqiJKcpAWH-I8kPr3kPGjCVWnwBAFubw0"]
["Writing NFT - 那些年我所追求的音樂...［音樂教我的事］專欄回顧_Beethoven : Concerto pour piano n°3","https://liker.land/nft/class/likenft17gqws99nmeg75f6z6mvqn8d9ey49z5p8ukp8s9mdd6ajfeg89u0qaxjvvm","iscn://likecoin-chain/QT3XyS_MXiY7vAfz4BUXB7JP43HeB6DqmLEiHUhJLJs"]
["Writing NFT - Phoebe & Kelvin 's wedding ","https://liker.land/nft/class/likenft17uxey69ps06vxzavn32fc2wpyxmhrv6a3lyz5d5d40qajeqneg8qx8h586","iscn://likecoin-chain/bKO7tAqA1r-j8bfwh_Bi0axjb7vgo_qkM1so7YNAtGU"]
["Writing NFT - 〔旅行到芬蘭〕哈士奇雪橇體驗","https://liker.land/nft/class/likenft17wejlzts2ne4s4t4xf75c42y5nty6vdqhcdz93phyjartjfrtajs32alts","iscn://likecoin-chain/NHy5d1RXsP4B3sIjeBG6iWKynWqcJHoXLHdzxJGRXXc"]
["Writing NFT - LikeCoin推出「Writing NFT 計畫」一鍵轉文章為NFT收藏、推動去中心化出版","https://liker.land/nft/class/likenft18nf6zu6grjxc3ym97qxjzxfaqvn8j689gnnragrfwrvvc8mn6axqx74d8c","iscn://likecoin-chain/0dy8t-GOR1nHAflNpze6s1vse-xKBewTO5aJsxI5Pws"]
["Writing NFT - 探索廢墟時，我看到隱藏的都市吶喊聲","https://liker.land/nft/class/likenft1957qy6zk8yd3653qxxtkfusvflxlc846jpnagu46kk37phznncrss2pdd7","iscn://likecoin-chain/dF-TlCE33g-xwcBAv6usdAll-Pna6fzLy1Y47qyezzs"]
["Writing NFT - 星巴克推出 NFT 忠誠度計畫：Polygon 是假議題、開放生態系優勢 - by 許明恩 - 區塊勢","https://liker.land/nft/class/likenft19mqnukxuy9qdfwqj6zpt2zyc5hzp9yfvcqgudezuul8cg4yh3jsqyqtfra","iscn://likecoin-chain/H0sO1kihReRHRKEFYGukAF7xqIt12ahAaISTQLZlAqc"]
["Writing NFT - 文字作品的NFT搜集與分享","https://liker.land/nft/class/likenft1a59d5ews2fjz5805yfp0fq22rark72krzh57k94df85nls6se8ws74uqj2","iscn://likecoin-chain/fGffBFCsxZHfSbaaksLBvLTJGzVtPMVu4Y7GtXqBXto"]
["Writing NFT - Liker Social：最被低估的 SocialFi 社群平台 - by 許明恩 - 區塊勢","https://liker.land/nft/class/likenft1arnqgraryg3s2jychzd8hvkxy2835lsydy9w3l24qa0xef68vudqfutmef","iscn://likecoin-chain/E-4ofrcX_TAYxbn7xLFK4WbXIhUsTVmC26wwKtaRKNI"]
["Writing NFT - 在旅途中尋找最珍貴的禮物 - 第一章","https://liker.land/nft/class/likenft1cytuck2sq7vl84dw7qak5ya0d7v0t2ys456n73pp9vqw9enka4tqjqm0q5","iscn://likecoin-chain/sdETbmFmmdkIU_yd3hKfj5-zp0LPhFQdLx7ka8VtIOQ"]
["Writing NFT - 讀後／小令《監視器的背後是彌勒佛》與若斯諾·孟《喜劇收場》","https://liker.land/nft/class/likenft1ddu90kxsu7ht8u8t94850zpcfcmnw5prkwregrm6pspaugtjw94qsse58d","iscn://likecoin-chain/a6Vyw_JhbtuOrfUckwDr5URAyq-0usiPsNTXFmE3Nd4"]
["Writing NFT - 區塊勢成為 LikeCoin 的區塊鏈驗證者 - by 許明恩 - 區塊勢","https://liker.land/nft/class/likenft1djs2rwaesefs9wxfg9hxk76psd4vdggkkkrzcv06dzksejve5s3se5mlxh","iscn://likecoin-chain/TiieWo8sD_DPNuvUo9LKP4BUpZMRhCkr9ha2Ch4gXro"]
["Writing NFT - 自己香港自己救 — 全民抗疫之自製搓手液","https://liker.land/nft/class/likenft1faqzun5eucvh07j0fnrk7wehs966y32wujxrfuvlkzwdyfg03h6qnrscau","iscn://likecoin-chain/pf-ANgzKBSkXhrm59btJ5q8hdqD7gaz5gsbkolk-QyI"]
["Writing NFT - 哩哩扣扣 #18 Writing NFT，與熊市推薦專案","https://liker.land/nft/class/likenft1gakr849rsely9g0qrqpfxcqx09rsn8uhuj0rj8g2f4w6pdzajauses8wu3","iscn://likecoin-chain/5EjIdwyqSOWBY94TSSXEMP_OaEmFKmbTAPJAhQq9g-s"]
["Writing NFT - 哩哩扣扣 #19 金鏟子就是聖杯","https://liker.land/nft/class/likenft1gdsj60q72ed5s52x7ccu5n8hgh3vp7ys26pdatlh6me9xh8tmn2sj8zwcs","iscn://likecoin-chain/xr_Z0GUgsa8nXt9zPKGmln_p9qv_22M4AORaoKf2nLw"]
["Writing NFT - 摸著石頭過河 - 初創筆記（二）","https://liker.land/nft/class/likenft1h2j5u9xaduv56w0uhyh4afzcvzn2ynp9p43zm7u9hww9auvy756qhga9rh","iscn://likecoin-chain/j2kFmpf_lr8lrV3dIcVoit0OHlRhYdHs5ZDMmwFu2CE"]
["Writing NFT - Sudoswap：會動態調整售價的 NFT 自動販賣機 - by 許明恩 - 區塊勢","https://liker.land/nft/class/likenft1jg6n8ema53fvevl0r5g7qv4xfupdn6dzpsll269g0tjme70d3teq97hu6h","iscn://likecoin-chain/SZATEuOAz1ESImyuic6VFQ4LG_EZpV68ae4hiUJCX44"]
["Writing NFT - LikeCoin Chain NFT Module Upgrade, StarFerry Overview","https://liker.land/nft/class/likenft1jvywpl0f0zndhm6h8sp44esaj88mrkew226wv30ymeq5pnvux4tq760qd7","iscn://likecoin-chain/uioz4L768qWnVId4uGVnzJqVEXWYo9YBVHAftZNjZWk"]
["Writing NFT - ECHO：會跟著文章跑、評論永存網路的去中心化留言區 - by 許明恩 - 區塊勢","https://liker.land/nft/class/likenft1k0xxf2yw755uymehkxvd3vteumm4jalmmy4k3g8g0e9ghdgwne2s50r45v","iscn://likecoin-chain/10S6m2CY1r5yXw1gUW8sGH1zBqxZo2EhRsMXJh3JdeM"]
["Writing NFT - 花と動物と人との架け橋プロジェクトセカンドチャレンジ | 神戸どうぶつ王国","https://liker.land/nft/class/likenft1kj2nkp844uj2d6nlgw2ypalruww0h36ja9lca0g2gz2pl3hjhvwq48pr6k","iscn://likecoin-chain/V2QZwU2LxKP5KVIKRuzcKukUXPythv8KbP4GvuHln1k"]
["Writing NFT - 【文化籽】野餐+看書+音樂　向詩遊 異鄉的也斯致意","https://liker.land/nft/class/likenft1lpfr5j88ss6valufrxd03v3zva6fyzr6aa6hxwwf444aqy87ptsqfp0f74","iscn://likecoin-chain/wo_Yh7RnUDvRHBq9-2ugan1i3nxVs6DnJjZU47M19g0"]
["Writing NFT - 二訪武藏小杉。在相同中發現不同","https://liker.land/nft/class/likenft1mac3g66wrml4w66uxspjxp59gkhye9gtv5wmxcxxhc99029q48esp5xldh","iscn://likecoin-chain/I87FFWZbzVZ4etSlqastKHVoEV_VyeZCfIKwWgyxNNU"]
["Writing NFT - 蘋果可望解禁 NFT：不能買的交易市集、不准躲的蘋果稅 - by 許明恩 - 區塊勢","https://liker.land/nft/class/likenft1msflmn4xndf83avhmvzzyavtssr8yc7qqw42ku553n0vfddx22wsjdz5m9","iscn://likecoin-chain/RkkUHKPxnxWPwonKhZWY5E5ZpoufLf6TPuqeOeyQSF8"]
["Writing NFT - 自閉症女兒爸爸的心聲","https://liker.land/nft/class/likenft1pevp43l00qturkc0wsh35uwvu2rh9wm3mfu83zmhtv7dhkallq9snqtnw3","iscn://likecoin-chain/lS-K_OZUopZPM-T9EFyf7cGs5qxegyTbxPbrQGxB9wI"]
["Writing NFT - LikeCoin AMA 講稿：在人生的最後階段，我將會以甚麼方式去記錄自己的心路歷程呢？ - 米高與小狗ThankYou (@DrThankYouC)","https://liker.land/nft/class/likenft1plaq9s4pkrrsumm87whg0hv03gy982xpdct0apg5c4v8w94w6w2s4gvjhv","iscn://likecoin-chain/26_cPlyrPe-ND1sCxuTo6tztLBt5_to70INUucWelII"]
["Writing NFT - 詩／夜半的弓道教室","https://liker.land/nft/class/likenft1q6n3f7qalut8c99cu5s6lnqaf9pe8mw832ex4uskt922mawsn0aqm5cyj8","iscn://likecoin-chain/AufyS6RX35vzMc-OLITYDhhKpcTmKyFvCyEAUX13C4Q"]
["Writing NFT - 【領取通知】中秋限定！元宇宙第一款 NFT 柚子帽 - by 許明恩 - 區塊勢","https://liker.land/nft/class/likenft1qp994p7ym97g3d2qvph260t6c42dsfxsrxdku055qzkh5hennmssag76zc","iscn://likecoin-chain/BmqLurO6Qfr6pdOvUE0EvuR1aukujMCm9In2qLFspcs"]
["Writing NFT - 沒事找事幹，探索香港的都市廢墟","https://liker.land/nft/class/likenft1r4np3ex4ny7xtqsc2kxhf7l03xes6y8v2jenmhfnrlgue2feahcqk4xt90","iscn://likecoin-chain/7JjsdY-DIX_naZE4NaG0-msFTmDUGjn0ZMzvQnIXhSQ"]
["Writing NFT - Writing NFT：不到 1 元，就能以出書的規格發行數位創作 - by 許明恩 - 區塊勢","https://liker.land/nft/class/likenft1s7xk7wt5q03lsa2a87fnqfc0uny28f46s4gtnakc08qdguxlua4qxrxk7m","iscn://likecoin-chain/L3B4UZDVx_2wcpY_mJUMYkYznyr52oYotKyXPtdbNj0"]
{"$rows_left_out":23}
{"sheet":"Sheet1","index":2,"n_rows":3,"n_cols":2,"rows_kept":3,"cut":false,"hidden":false,"merged":[]}
["ckxpress","like13f4glvg80zvfrrs7utft5p68pct4mcq7t5atf6"]
["許明恩","like128l3t64trehh8jnr8klqaj8c2sug6wlg4jxqf8"]
["Pazu薯伯伯","like1fph6p38zvhhdgp7sm8zc258vk2p52ganzck5tr"]